Reaction Details
TargetFatty acid-binding protein, liver [T94A]
LigandBDBM28700
Substrate/Competitorn/a
Meas. Tech.ANS Fluorescence Displacement Assay
Ki 3.1e+2± 3e+1 nM
Citation Martin, GGMcIntosh, ALHuang, HGupta, SAtshaves, BPLandrock, KKLandrock, DKier, ABSchroeder, F The human liver fatty acid binding protein T94A variant alters the structure, stability, and interaction with fibrates. Biochemistry52:9347-57 (2013) 
 
Fatty acid-binding protein, liver [T94A]
Name:Fatty acid-binding protein, liver [T94A]
Type:Protein
Mol. Mass.:14178.70
Organism:Homo sapiens (Human)
Description:human L-FABP mutant T94A
Residue:127
BDBM28700
NameBDBM28700
Synonyms:2-(4-(4-Chlorobenzoyl)phenoxy)-2-methylpropionic acid CHEMBL981 FIBRICOR LF 153 procetofenic acid
TypeSmall organic molecule
Emp. Form.C17H15ClO4
Mol. Mass.318.752
SMILESCC(C)(Oc1ccc(cc1)C(=O)c1ccc(Cl)cc1)C(O)=O