Reaction Details
TargetRho-associated protein kinase 2
LigandBDBM119905
Substrate/Competitorn/a
Meas. Tech.IMAP Assay
pH7.2±n/a
IC50 0.45±n/a nM
Citation Cook, BNKowalski, JALi, XMarshall, DRSchlyer, SSibley, RSmith-Keenan, LLSoleymanzadeh, FSorcek, RJYoung, ERZhang, Y Rho kinase inhibitors US Patent US8697911 Publication Date 4/15/2014
 
Rho-associated protein kinase 2
Name:Rho-associated protein kinase 2
Type:Protein
Mol. Mass.:160885.43
Organism:Homo sapiens (Human)
Description:O75116
Residue:1388
BDBM119905
NameBDBM119905
Synonyms:US8697911, 28
TypeSmall organic molecule
Emp. Form.C25H24N6O2S
Mol. Mass.472.562
SMILESN[C@@H]1CCc2nc(NC(=O)c3cccc(CNC(=O)c4cccc(c4)-c4cn[nH]c4)c3)sc2C1