Reaction Details
TargetRho-associated protein kinase 2
LigandBDBM119933
Substrate/Competitorn/a
Meas. Tech.IMAP Assay
pH7.2±n/a
IC50 0.25±n/a nM
Citation Cook, BNKowalski, JALi, XMarshall, DRSchlyer, SSibley, RSmith-Keenan, LLSoleymanzadeh, FSorcek, RJYoung, ERZhang, Y Rho kinase inhibitors US Patent US8697911 Publication Date 4/15/2014
 
Rho-associated protein kinase 2
Name:Rho-associated protein kinase 2
Type:Protein
Mol. Mass.:160885.43
Organism:Homo sapiens (Human)
Description:O75116
Residue:1388
BDBM119933
NameBDBM119933
Synonyms:US8697911, 70
TypeSmall organic molecule
Emp. Form.C28H26N4O2S
Mol. Mass.482.597
SMILESCN1CCc2ccc(NC(=O)c3cccc(CNC(=O)c4ccc(s4)-c4ccncc4)c3)cc2C1