Reaction Details
TargetRho-associated protein kinase 2
LigandBDBM119937
Substrate/Competitorn/a
Meas. Tech.IMAP Assay
pH7.2±n/a
IC50 0.58±n/a nM
Citation Cook, BNKowalski, JALi, XMarshall, DRSchlyer, SSibley, RSmith-Keenan, LLSoleymanzadeh, FSorcek, RJYoung, ERZhang, Y Rho kinase inhibitors US Patent US8697911 Publication Date 4/15/2014
 
Rho-associated protein kinase 2
Name:Rho-associated protein kinase 2
Type:Protein
Mol. Mass.:160885.43
Organism:Homo sapiens (Human)
Description:O75116
Residue:1388
BDBM119937
NameBDBM119937
Synonyms:US8697911, 80
TypeSmall organic molecule
Emp. Form.C28H25N5O2
Mol. Mass.463.5304
SMILESCN1CCc2ccc(NC(=O)c3cccc(CNC(=O)c4cc5cc(ccc5[nH]4)C#N)c3)cc2C1