Reaction Details
TargetRho-associated protein kinase 2
LigandBDBM119966
Substrate/Competitorn/a
Meas. Tech.IMAP Assay
pH7.2±n/a
IC50 0.22±n/a nM
Citation Cook, BNKowalski, JALi, XMarshall, DRSchlyer, SSibley, RSmith-Keenan, LLSoleymanzadeh, FSorcek, RJYoung, ERZhang, Y Rho kinase inhibitors US Patent US8697911 Publication Date 4/15/2014
 
Rho-associated protein kinase 2
Name:Rho-associated protein kinase 2
Type:Protein
Mol. Mass.:160885.43
Organism:Homo sapiens (Human)
Description:O75116
Residue:1388
BDBM119966
NameBDBM119966
Synonyms:US8697911, 130
TypeSmall organic molecule
Emp. Form.C25H26N6O2S2
Mol. Mass.506.643
SMILESCN(C)[C@H]1CCc2nc(NC(=O)c3cccc(CNC(=O)c4ccc(s4)-c4cn[nH]c4)c3)sc2C1