Reaction Details
TargetRho-associated protein kinase 2
LigandBDBM120005
Substrate/Competitorn/a
Meas. Tech.IMAP Assay
pH7.2±n/a
IC50 0.2±n/a nM
Citation Cook, BNKowalski, JALi, XMarshall, DRSchlyer, SSibley, RSmith-Keenan, LLSoleymanzadeh, FSorcek, RJYoung, ERZhang, Y Rho kinase inhibitors US Patent US8697911 Publication Date 4/15/2014
 
Rho-associated protein kinase 2
Name:Rho-associated protein kinase 2
Type:Protein
Mol. Mass.:160885.43
Organism:Homo sapiens (Human)
Description:O75116
Residue:1388
BDBM120005
NameBDBM120005
Synonyms:US8697911, 207
TypeSmall organic molecule
Emp. Form.C26H27N7O2S
Mol. Mass.501.603
SMILESCN(C)[C@H]1CCc2nc(NC(=O)c3cccc(CNC(=O)c4cc(n[nH]4)-c4ccncc4)c3)sc2C1