Reaction Details
TargetNon-receptor tyrosine-protein kinase TYK2
LigandBDBM120129
Substrate/Competitorn/a
Meas. Tech.Inhibition Assay
pH7.2±n/a
Temperature295.15±n/a K
Ki 1.4±n/a nM
Commentsextracted
Citation Blench, TJEllwood, CGoodacre, SCLai, YLiang, JMacleod, CMagnuson, SRTsui, VHWilliams, KZhang, B Azabenzothiazole compounds, compositions and methods of use US Patent US8697708 Publication Date 4/15/2014
 
Non-receptor tyrosine-protein kinase TYK2
Name:Non-receptor tyrosine-protein kinase TYK2
Type:Protein
Mol. Mass.:133666.03
Organism:Homo sapiens (Human)
Description:P29597
Residue:1187
BDBM120129
NameBDBM120129
Synonyms:US8697708, 9
TypeSmall organic molecule
Emp. Form.C14H9Cl2N3O2S
Mol. Mass.354.211
SMILESCOC(=O)Nc1nccc2nc(sc12)-c1c(Cl)cccc1Cl