Reaction Details
TargetNon-receptor tyrosine-protein kinase TYK2
LigandBDBM120134
Substrate/Competitorn/a
Meas. Tech.Inhibition Assay
pH7.2±n/a
Temperature295.15±n/a K
Ki 6.2±n/a nM
Commentsextracted
Citation Blench, TJEllwood, CGoodacre, SCLai, YLiang, JMacleod, CMagnuson, SRTsui, VHWilliams, KZhang, B Azabenzothiazole compounds, compositions and methods of use US Patent US8697708 Publication Date 4/15/2014
 
Non-receptor tyrosine-protein kinase TYK2
Name:Non-receptor tyrosine-protein kinase TYK2
Type:Protein
Mol. Mass.:133666.03
Organism:Homo sapiens (Human)
Description:P29597
Residue:1187
BDBM120134
NameBDBM120134
Synonyms:US8697708, 24
TypeSmall organic molecule
Emp. Form.C15H10Cl2N4OS
Mol. Mass.365.237
SMILESClc1cccc(Cl)c1-c1nc2ncnc(NC(=O)C3CC3)c2s1