Reaction Details
TargetTyrosine-protein kinase BTK
LigandBDBM120748
Substrate/Competitorn/a
Meas. Tech.Time Resolved-FRET Assay
Temperature298.15±n/a K
IC50 47±n/a nM
Commentsextracted
Citation Bearss, DJVankayalapati, HSorna, VWarner, SLSharma, S Substituted N-(3-(pyrimidin-4-yl)phenyl)acrylamide analogs as tyrosine receptor kinase BTK inhibitors US Patent US8703767 Publication Date 4/22/2014
 
Tyrosine-protein kinase BTK
Name:Tyrosine-protein kinase BTK
Type:Enzyme
Mol. Mass.:76289.95
Organism:Homo sapiens (Human)
Description:Q06187
Residue:659
BDBM120748
NameBDBM120748
Synonyms:US8703767, 8
TypeSmall organic molecule
Emp. Form.C23H22ClN5O2
Mol. Mass.435.906
SMILESClc1cnc(Nc2ccc(cc2)N2CCOCC2)nc1-c1cccc(NC(=O)C=C)c1