Reaction Details
TargetSerine/threonine-protein kinase Chk1
LigandBDBM120932
Substrate/Competitorn/a
Meas. Tech.Inhibiting Assay
pH7.5±n/a
IC50 0.73±n/a nM
Citation Boyle, RGWalker, DWBoyce, RJ Pharmaceutical compounds US Patent US8716287 Publication Date 5/6/2014
 
Serine/threonine-protein kinase Chk1
Name:Serine/threonine-protein kinase Chk1
Type:Enzyme Catalytic Domain
Mol. Mass.:54443.02
Organism:Homo sapiens (Human)
Description:gi_166295192
Residue:476
BDBM120932
NameBDBM120932
Synonyms:US8716287, 65
TypeSmall organic molecule
Emp. Form.C24H25ClN6O3
Mol. Mass.480.947
SMILESCOc1cccc(c1)[C@H](C)NCCc1cc(OC)c(NC(=O)Nc2cnc(cn2)C#N)cc1Cl