Reaction Details
TargetVascular endothelial growth factor receptor 1
LigandBDBM50381698
Substrate/Competitorn/a
Meas. Tech.Homogenous Time-Resolved Fluorescence Assay (HTRF)
pH7.1±n/a
Temperature298.15±n/a K
IC50 1.9±n/a nM
Commentsextracted
Citation Michaelides, MRFrey, RCurtin, M Thieno[3,2-C]pyridine kinase inhibitors with improved CYP safety profile US Patent US8722890 Publication Date 5/13/2014
 
Vascular endothelial growth factor receptor 1
Name:Vascular endothelial growth factor receptor 1
Type:Receptor Tyrosine Kinase
Mol. Mass.:150800.23
Organism:Homo sapiens (Human)
Description:P17948
Residue:1338
BDBM50381698
NameBDBM50381698
Synonyms:CHEMBL1969102 | US8722890, 6
TypeSmall organic molecule
Emp. Form.C24H20N6OS
Mol. Mass.440.52
SMILESCc1cccc(NC(=O)Nc2ccc(cc2)-c2csc3c(cnc(N)c23)-c2cn[nH]c2)c1