Reaction Details
TargetAurora kinase A
LigandBDBM50381716
Substrate/Competitorn/a
Meas. Tech.Enzyme Inhibtion Assay
pH7.4±n/a
IC50 4743.1±n/a nM
Commentsextracted
Citation Michaelides, MRFrey, RCurtin, M Thieno[3,2-C]pyridine kinase inhibitors with improved CYP safety profile US Patent US8722890 Publication Date 5/13/2014
 
Aurora kinase A
Name:Aurora kinase A
Type:Serine/threonine-protein kinase
Mol. Mass.:45830.98
Organism:Homo sapiens (Human)
Description:O14965
Residue:403
BDBM50381716
NameBDBM50381716
Synonyms:ABT-348 US8722890, 1 | US8722890, 2
TypeSmall organic molecule
Emp. Form.C25H21FN6O2S
Mol. Mass.488.537
SMILESNc1ncc(-c2cnn(CCO)c2)c2scc(-c3ccc(NC(=O)Nc4cccc(F)c4)cc3)c12