Reaction Details
TargetD(3) dopamine receptor
LigandBDBM121467
Substrate/Competitorn/a
Meas. Tech.Radioligand Binding Assay
Ki 0.91±n/a nM
Citation Rodriguez Sarmiento, RMWichmann, J Benzodioxole piperazine compounds US Patent US8722683 Publication Date 5/13/2014
 
D(3) dopamine receptor
Name:D(3) dopamine receptor
Type:n/a
Mol. Mass.:44243.43
Organism:Homo sapiens (Human)
Description:n/a
Residue:400
BDBM121467
NameBDBM121467
Synonyms:US8722683, 14
TypeSmall organic molecule
Emp. Form.C22H30N4O3
Mol. Mass.398.4986
SMILESO=C(CC#N)N[C@H]1CC[C@H](CCN2CCN(CC2)c2cccc3OCOc23)CC1