Reaction Details
TargetD(3) dopamine receptor
LigandBDBM121469
Substrate/Competitorn/a
Meas. Tech.Radioligand Binding Assay
Ki 1.57±n/a nM
Citation Rodriguez Sarmiento, RMWichmann, J Benzodioxole piperazine compounds US Patent US8722683 Publication Date 5/13/2014
 
D(3) dopamine receptor
Name:D(3) dopamine receptor
Type:n/a
Mol. Mass.:44243.43
Organism:Homo sapiens (Human)
Description:n/a
Residue:400
BDBM121469
NameBDBM121469
Synonyms:US8722683, 16
TypeSmall organic molecule
Emp. Form.C22H30F3N3O3
Mol. Mass.441.4871
SMILESFC(F)(F)CC(=O)N[C@H]1CC[C@H](CCN2CCN(CC2)c2cccc3OCOc23)CC1