Reaction Details
TargetD(2) dopamine receptor
LigandBDBM121460
Substrate/Competitorn/a
Meas. Tech.Radioligand Binding Assay
Ki 74.48±n/a nM
Citation Rodriguez Sarmiento, RMWichmann, J Benzodioxole piperazine compounds US Patent US8722683 Publication Date 5/13/2014
 
D(2) dopamine receptor
Name:D(2) dopamine receptor
Type:Cell-surface receptors
Mol. Mass.:50647.10
Organism:Homo sapiens (Human)
Description:P14416
Residue:443
BDBM121460
NameBDBM121460
Synonyms:US8722683, 7
TypeSmall organic molecule
Emp. Form.C22H33N3O3
Mol. Mass.387.5157
SMILESCCC(=O)N[C@H]1CC[C@H](CCN2CCN(CC2)c2cccc3OCOc23)CC1