Reaction Details
TargetDual specificity protein kinase CLK1
LigandBDBM103302
Substrate/Competitorn/a
Meas. Tech.Selectivity screening
IC50 508±0.0 nM
Citation Chaikuad, ATacconi, EMZimmer, JLiang, YGray, NSTarsounas, MKnapp, S A unique inhibitor binding site in ER K1/2 is associated with slow binding kinetics Nat Chem Biol10:853-860 (2014) 
 
Dual specificity protein kinase CLK1
Name:Dual specificity protein kinase CLK1
Type:Protein
Mol. Mass.:57322.21
Organism:Homo sapiens (Human)
Description:P49759
Residue:484
BDBM103302
NameBDBM103302
Synonyms:SCH772984 | US8546404, 6
TypeSmall organic molecule
Emp. Form.C33H33N9O2
Mol. Mass.587.6742
SMILESO=C(CN1CC[C@@H](C1)C(=O)Nc1ccc2[nH]nc(-c3ccncc3)c2c1)N1CCN(CC1)c1ccc(cc1)-c1ncccn1