Reaction Details
TargetPhosphatidylinositol 4,5-bisphosphate 3-kinase catalytic subunit alpha isoform
LigandBDBM122447
Substrate/Competitorn/a
Meas. Tech.AlphaScreen Assay
Ki 1291±n/a nM
IC50 931±n/a nM
Citation Bo, YYLiu, LNishimura, NNorman, MHSiegmund, ACTamayo, NAYang, KC Inhibitors of PI3 kinase US Patent US8729074 Publication Date 5/20/2014
 
Phosphatidylinositol 4,5-bisphosphate 3-kinase catalytic subunit alpha isoform
Name:Phosphatidylinositol 4,5-bisphosphate 3-kinase catalytic subunit alpha isoform
Type:Enzyme Subunit
Mol. Mass.:124294.87
Organism:Homo sapiens (Human)
Description:P42336
Residue:1068
BDBM122447
NameBDBM122447
Synonyms:US8729074, 2
TypeSmall organic molecule
Emp. Form.C18H13FN4O2S
Mol. Mass.368.385
SMILESFc1ccc(cc1)S(=O)(=O)Nc1cncc(c1)-c1cnc2ccccn12