Reaction Details
TargetPhosphatidylinositol 4,5-bisphosphate 3-kinase catalytic subunit alpha isoform
LigandBDBM122448
Substrate/Competitorn/a
Meas. Tech.AlphaScreen Assay
Ki 20±n/a nM
IC50 16±n/a nM
Citation Bo, YYLiu, LNishimura, NNorman, MHSiegmund, ACTamayo, NAYang, KC Inhibitors of PI3 kinase US Patent US8729074 Publication Date 5/20/2014
 
Phosphatidylinositol 4,5-bisphosphate 3-kinase catalytic subunit alpha isoform
Name:Phosphatidylinositol 4,5-bisphosphate 3-kinase catalytic subunit alpha isoform
Type:Enzyme Subunit
Mol. Mass.:124294.87
Organism:Homo sapiens (Human)
Description:P42336
Residue:1068
BDBM122448
NameBDBM122448
Synonyms:US8729074, 5
TypeSmall organic molecule
Emp. Form.C19H13BrClFN4O2S
Mol. Mass.495.753
SMILESCc1nc2ccc(Br)cn2c1-c1cnc(Cl)c(NS(=O)(=O)c2ccc(F)cc2)c1