Reaction Details
TargetPhosphatidylinositol 4,5-bisphosphate 3-kinase catalytic subunit alpha isoform
LigandBDBM122450
Substrate/Competitorn/a
Meas. Tech.AlphaScreen Assay
Ki 2±n/a nM
IC50 5±n/a nM
Citation Bo, YYLiu, LNishimura, NNorman, MHSiegmund, ACTamayo, NAYang, KC Inhibitors of PI3 kinase US Patent US8729074 Publication Date 5/20/2014
 
Phosphatidylinositol 4,5-bisphosphate 3-kinase catalytic subunit alpha isoform
Name:Phosphatidylinositol 4,5-bisphosphate 3-kinase catalytic subunit alpha isoform
Type:Enzyme Subunit
Mol. Mass.:124294.87
Organism:Homo sapiens (Human)
Description:P42336
Residue:1068
BDBM122450
NameBDBM122450
Synonyms:US8729074, 7
TypeSmall organic molecule
Emp. Form.C23H15ClFN5O2S
Mol. Mass.479.914
SMILESFc1ccc(cc1)S(=O)(=O)Nc1cc(cnc1Cl)-c1cnc2ccc(cn12)-c1ccncc1