Reaction Details
TargetPhosphatidylinositol 4,5-bisphosphate 3-kinase catalytic subunit alpha isoform
LigandBDBM122454
Substrate/Competitorn/a
Meas. Tech.AlphaScreen Assay
Ki 626±n/a nM
IC50 861±n/a nM
Citation Bo, YYLiu, LNishimura, NNorman, MHSiegmund, ACTamayo, NAYang, KC Inhibitors of PI3 kinase US Patent US8729074 Publication Date 5/20/2014
 
Phosphatidylinositol 4,5-bisphosphate 3-kinase catalytic subunit alpha isoform
Name:Phosphatidylinositol 4,5-bisphosphate 3-kinase catalytic subunit alpha isoform
Type:Enzyme Subunit
Mol. Mass.:124294.87
Organism:Homo sapiens (Human)
Description:P42336
Residue:1068
BDBM122454
NameBDBM122454
Synonyms:US8729074, 12
TypeSmall organic molecule
Emp. Form.C19H16N4O2
Mol. Mass.332.3559
SMILESCOc1cc(cnc1OC)-c1cnc2ccc(cn12)-c1ccncc1