Reaction Details
TargetPhosphatidylinositol 4,5-bisphosphate 3-kinase catalytic subunit alpha isoform
LigandBDBM122461
Substrate/Competitorn/a
Meas. Tech.AlphaScreen Assay
Ki 15±n/a nM
Citation Bo, YYLiu, LNishimura, NNorman, MHSiegmund, ACTamayo, NAYang, KC Inhibitors of PI3 kinase US Patent US8729074 Publication Date 5/20/2014
 
Phosphatidylinositol 4,5-bisphosphate 3-kinase catalytic subunit alpha isoform
Name:Phosphatidylinositol 4,5-bisphosphate 3-kinase catalytic subunit alpha isoform
Type:Enzyme Subunit
Mol. Mass.:124294.87
Organism:Homo sapiens (Human)
Description:P42336
Residue:1068
BDBM122461
NameBDBM122461
Synonyms:US8729074, 21
TypeSmall organic molecule
Emp. Form.C19H17ClN6O2S
Mol. Mass.428.895
SMILESCN(C)S(=O)(=O)Nc1cc(cnc1Cl)-c1cnc2cc(ccn12)-c1ccncc1