Reaction Details
TargetSerine/threonine-protein kinase mTOR
LigandBDBM122449
Substrate/Competitorn/a
Meas. Tech.In Vitro mTOR Assay
IC50 39±n/a nM
Citation Bo, YYLiu, LNishimura, NNorman, MHSiegmund, ACTamayo, NAYang, KC Inhibitors of PI3 kinase US Patent US8729074 Publication Date 5/20/2014
 
Serine/threonine-protein kinase mTOR
Name:Serine/threonine-protein kinase mTOR
Type:Rapamycin target protein
Mol. Mass.:288917.12
Organism:Homo sapiens (Human)
Description:P42345
Residue:2549
BDBM122449
NameBDBM122449
Synonyms:US8729074, 6
TypeSmall organic molecule
Emp. Form.C18H11BrClFN4O2S
Mol. Mass.481.726
SMILESFc1ccc(cc1)S(=O)(=O)Nc1cc(cnc1Cl)-c1cnc2ccc(Br)cn12