Reaction Details
TargetSerine/threonine-protein kinase mTOR
LigandBDBM122457
Substrate/Competitorn/a
Meas. Tech.In Vitro mTOR Assay
IC50 2038±n/a nM
Citation Bo, YYLiu, LNishimura, NNorman, MHSiegmund, ACTamayo, NAYang, KC Inhibitors of PI3 kinase US Patent US8729074 Publication Date 5/20/2014
 
Serine/threonine-protein kinase mTOR
Name:Serine/threonine-protein kinase mTOR
Type:Rapamycin target protein
Mol. Mass.:288917.12
Organism:Homo sapiens (Human)
Description:P42345
Residue:2549
BDBM122457
NameBDBM122457
Synonyms:US8729074, 15
TypeSmall organic molecule
Emp. Form.C24H22N4O4
Mol. Mass.430.4559
SMILESCOc1cc(cnc1OC)-c1cnc2ccc(cn12)N1[C@@H](Cc2ccccc2)COC1=O