Reaction Details
TargetGag-Pol polyprotein [489-587,G537V,H558K,V571A]
LigandBDBM122998
Substrate/Competitorn/a
Meas. Tech.Enzymatic Assay
IC50 0.995±n/a nM
Citation Stranix, BRLavallee, JLeberre, NPerron, VHerbart, DMilot, GPanchal, C Protease inhibitors US Patent US8742158 Publication Date 6/3/2014
 
Gag-Pol polyprotein [489-587,G537V,H558K,V571A]
Name:Gag-Pol polyprotein [489-587,G537V,H558K,V571A]
Type:Protein
Mol. Mass.:10827.77
Organism:Human immunodeficiency virus
Description:P12497[489-587,G537V,H558K,V571A]
Residue:99
BDBM122998
NameBDBM122998
Synonyms:US8742158, EX 15
TypeSmall organic molecule
Emp. Form.C36H48N4O5S
Mol. Mass.648.855
SMILESCC(C)CN(Sc1ccc2OCCc2c1)[C@H](CO)CCCCNC(=O)[C@@H](Cc1cccc2ccccc12)NC(=O)N1CCOCC1