Reaction Details
TargetGag-Pol polyprotein [489-587,G537V,H558K,V571A]
LigandBDBM123007
Substrate/Competitorn/a
Meas. Tech.Enzymatic Assay
IC50 2.15±n/a nM
Citation Stranix, BRLavallee, JLeberre, NPerron, VHerbart, DMilot, GPanchal, C Protease inhibitors US Patent US8742158 Publication Date 6/3/2014
 
Gag-Pol polyprotein [489-587,G537V,H558K,V571A]
Name:Gag-Pol polyprotein [489-587,G537V,H558K,V571A]
Type:Protein
Mol. Mass.:10827.77
Organism:Human immunodeficiency virus
Description:P12497[489-587,G537V,H558K,V571A]
Residue:99
BDBM123007
NameBDBM123007
Synonyms:US8742158, EX 30
TypeSmall organic molecule
Emp. Form.C32H42ClN5O5S
Mol. Mass.644.224
SMILESCC(C)CN([C@H](CO)CCCCNC(=O)[C@H](Cc1ccccc1Cl)NC(=O)c1cccnc1C)S(=O)(=O)c1ccc(N)cc1