Reaction Details
TargetGag-Pol polyprotein [489-587,G537V,H558K,V571A]
LigandBDBM123001
Substrate/Competitorn/a
Meas. Tech.Enzymatic Assay
IC50 3.659±n/a nM
Citation Stranix, BRLavallee, JLeberre, NPerron, VHerbart, DMilot, GPanchal, C Protease inhibitors US Patent US8742158 Publication Date 6/3/2014
 
Gag-Pol polyprotein [489-587,G537V,H558K,V571A]
Name:Gag-Pol polyprotein [489-587,G537V,H558K,V571A]
Type:Protein
Mol. Mass.:10827.77
Organism:Human immunodeficiency virus
Description:P12497[489-587,G537V,H558K,V571A]
Residue:99
BDBM123001
NameBDBM123001
Synonyms:US8742158, EX 31
TypeSmall organic molecule
Emp. Form.C32H47BrN4O8S
Mol. Mass.727.707
SMILESCC(C)CN([C@H](CO)CCCCNC(=O)[C@H](CC1=C(Br)CCC=C1)NC(=O)N1CCOCC1)S(=O)(=O)c1ccc2OCCOc2c1