Reaction Details
TargetGag-Pol polyprotein [489-587,G537V,H558K,V571A]
LigandBDBM122982
Substrate/Competitorn/a
Meas. Tech.Enzymatic Assay
IC50 1.073±n/a nM
Citation Stranix, BRLavallee, JLeberre, NPerron, VHerbart, DMilot, GPanchal, C Protease inhibitors US Patent US8742158 Publication Date 6/3/2014
 
Gag-Pol polyprotein [489-587,G537V,H558K,V571A]
Name:Gag-Pol polyprotein [489-587,G537V,H558K,V571A]
Type:Protein
Mol. Mass.:10827.77
Organism:Human immunodeficiency virus
Description:P12497[489-587,G537V,H558K,V571A]
Residue:99
BDBM122982
NameBDBM122982
Synonyms:US8742158, EX. 8
TypeSmall organic molecule
Emp. Form.C33H43N5O5S
Mol. Mass.621.79
SMILESCC(C)CN(C(CCCCNC(=O)[C@@H](NC(C)=O)C(c1ccccc1)c1ccccc1)C(N)=O)S(=O)(=O)c1ccc(N)cc1