Reaction Details
TargetGag-Pol polyprotein [489-587,G537V,H558K,V571A]
LigandBDBM122983
Substrate/Competitorn/a
Meas. Tech.Enzymatic Assay
IC50 0.58±n/a nM
Citation Stranix, BRLavallee, JLeberre, NPerron, VHerbart, DMilot, GPanchal, C Protease inhibitors US Patent US8742158 Publication Date 6/3/2014
 
Gag-Pol polyprotein [489-587,G537V,H558K,V571A]
Name:Gag-Pol polyprotein [489-587,G537V,H558K,V571A]
Type:Protein
Mol. Mass.:10827.77
Organism:Human immunodeficiency virus
Description:P12497[489-587,G537V,H558K,V571A]
Residue:99
BDBM122983
NameBDBM122983
Synonyms:US8742158, EX. 9
TypeSmall organic molecule
Emp. Form.C34H48N6O6S
Mol. Mass.668.847
SMILESCC(C)CN(C(CCCCNC(=O)[C@H](CC1=C2C=CC=CC2CC=C1)NC(=O)N1CCOCC1)C(N)=O)S(=O)(=O)c1ccc(N)cc1