Reaction Details
TargetC-C chemokine receptor type 3
LigandBDBM123086
Substrate/Competitorn/a
Meas. Tech.Scintillation Proximity Assay
Ki 231.6±n/a nM
Citation Frank, MHaeberle, HHenry, MPachur, TSantagostino, MStertz, UTrebing, TWerthmann, U Co-crystals and salts of CCR3-inhibitors US Patent US8742115 Publication Date 6/3/2014
 
C-C chemokine receptor type 3
Name:C-C chemokine receptor type 3
Type:Enzyme
Mol. Mass.:41053.88
Organism:Homo sapiens (Human)
Description:P51677
Residue:355
BDBM123086
NameBDBM123086
Synonyms:US8742115, 26
TypeSmall organic molecule
Emp. Form.C27H34ClN5O4
Mol. Mass.528.043
SMILESCOc1cc(cc(NC(=O)[C@H]2CCC(=O)N2C2CCN(Cc3ccc(Cl)c(C)c3)CC2)n1)C(=O)N(C)C