Reaction Details
TargetC-C chemokine receptor type 3
LigandBDBM123096
Substrate/Competitorn/a
Meas. Tech.Scintillation Proximity Assay
Ki 1.7±n/a nM
Citation Frank, MHaeberle, HHenry, MPachur, TSantagostino, MStertz, UTrebing, TWerthmann, U Co-crystals and salts of CCR3-inhibitors US Patent US8742115 Publication Date 6/3/2014
 
C-C chemokine receptor type 3
Name:C-C chemokine receptor type 3
Type:Enzyme
Mol. Mass.:41053.88
Organism:Homo sapiens (Human)
Description:P51677
Residue:355
BDBM123096
NameBDBM123096
Synonyms:US10213421, Example 10 US8742115, 36
TypeSmall organic molecule
Emp. Form.C28H36ClN5O3
Mol. Mass.526.07
SMILESCCN(C)C(=O)c1cc(C)nc(NC(=O)[C@H]2CCC(=O)N2C2CCN(Cc3ccc(Cl)c(C)c3)CC2)c1