Reaction Details
TargetGlucagon receptor
LigandBDBM123547
Substrate/Competitorn/a
Meas. Tech.Binding Assay
pH7.4±n/a
Ki 21.3±n/a nM
Citation Chakravarty, DKreutter, KPowell, MShook, BSong, FXu, GYang, SZhang, RZhao, B Picolinamido-propanoic acid derivatives useful as glucagon receptor antagonists US Patent US8748624 Publication Date 6/10/2014
 
Glucagon receptor
Name:Glucagon receptor
Type:Enzyme
Mol. Mass.:54026.92
Organism:Homo sapiens (Human)
Description:P47871
Residue:477
BDBM123547
NameBDBM123547
Synonyms:US8748624, 33
TypeSmall organic molecule
Emp. Form.C29H21Cl2F4N3O3
Mol. Mass.606.395
SMILESOC(=O)CCNC(=O)c1ccc(cn1)-c1cc(ccc1CNc1ccc(c(Cl)c1)-c1ccc(F)cc1Cl)C(F)(F)F