Reaction Details
TargetGlucagon receptor
LigandBDBM123580
Substrate/Competitorn/a
Meas. Tech.Binding Assay
pH7.4±n/a
Ki 20.3±n/a nM
Citation Chakravarty, DKreutter, KPowell, MShook, BSong, FXu, GYang, SZhang, RZhao, B Picolinamido-propanoic acid derivatives useful as glucagon receptor antagonists US Patent US8748624 Publication Date 6/10/2014
 
Glucagon receptor
Name:Glucagon receptor
Type:Enzyme
Mol. Mass.:54026.92
Organism:Homo sapiens (Human)
Description:P47871
Residue:477
BDBM123580
NameBDBM123580
Synonyms:US8748624, 72
TypeSmall organic molecule
Emp. Form.C29H21Cl3F3N3O3
Mol. Mass.622.85
SMILESOC(=O)CCNC(=O)c1ccc(cn1)-c1cc(cc(Cl)c1CNc1ccc(cc1)-c1ccc(Cl)cc1Cl)C(F)(F)F