Reaction Details
TargetCore-binding factor subunit beta
LigandBDBM123663
Substrate/Competitorn/a
Meas. Tech.FRET Assay
IC50 1800±n/a nM
Citation Bushweller, JHGrembecka, JIllendula, ADixon, L Inhibitors of inv(16) leukemia US Patent US8748618 Publication Date 6/10/2014
 
Core-binding factor subunit beta
Name:Core-binding factor subunit beta
Type:Enzyme
Mol. Mass.:21507.90
Organism:Homo sapiens (Human)
Description:Q13951
Residue:182
BDBM123663
NameBDBM123663
Synonyms:US8748618, AI-10-35
TypeSmall organic molecule
Emp. Form.C13H11N3S
Mol. Mass.241.312
SMILESSCc1ccc2nc([nH]c2c1)-c1ccccn1