Reaction Details
TargetCore-binding factor subunit beta
LigandBDBM123672
Substrate/Competitorn/a
Meas. Tech.FRET Assay
IC50 700±n/a nM
Citation Bushweller, JHGrembecka, JIllendula, ADixon, L Inhibitors of inv(16) leukemia US Patent US8748618 Publication Date 6/10/2014
 
Core-binding factor subunit beta
Name:Core-binding factor subunit beta
Type:Enzyme
Mol. Mass.:21507.90
Organism:Homo sapiens (Human)
Description:Q13951
Residue:182
BDBM123672
NameBDBM123672
Synonyms:US8748618, AI-4-49
TypeSmall organic molecule
Emp. Form.C12H7Cl2N3
Mol. Mass.264.11
SMILESClc1cc(Cl)c2[nH]c(nc2c1)-c1ccccn1