Reaction Details
TargetCore-binding factor subunit beta
LigandBDBM123680
Substrate/Competitorn/a
Meas. Tech.FRET Assay
IC50 2300±n/a nM
Citation Bushweller, JHGrembecka, JIllendula, ADixon, L Inhibitors of inv(16) leukemia US Patent US8748618 Publication Date 6/10/2014
 
Core-binding factor subunit beta
Name:Core-binding factor subunit beta
Type:Enzyme
Mol. Mass.:21507.90
Organism:Homo sapiens (Human)
Description:Q13951
Residue:182
BDBM123680
NameBDBM123680
Synonyms:US8748618, AI-10-11
TypeSmall organic molecule
Emp. Form.C16H17N3O3
Mol. Mass.299.3245
SMILESCOCCOc1ccc(nc1)-c1nc2ccc(CO)cc2[nH]1