Reaction Details
TargetDual specificity calcium/calmodulin-dependent 3',5'-cyclic nucleotide phosphodiesterase 1C
LigandBDBM123687
Substrate/Competitorn/a
Meas. Tech.In Vitro Inhibition Assay
pH7.5±n/a
IC50 720±n/a nM
Commentsextracted
Citation Hendrix, MBöβ, FBurkhardt, NErb, CTersteegen, AVan Kampen, M Alkyl-substituted pyrazolopyrimidines US Patent US8741907 Publication Date 6/3/2014
 
Dual specificity calcium/calmodulin-dependent 3',5'-cyclic nucleotide phosphodiesterase 1C
Name:Dual specificity calcium/calmodulin-dependent 3',5'-cyclic nucleotide phosphodiesterase 1C
Type:Enzyme
Mol. Mass.:80778.58
Organism:Homo sapiens (Human)
Description:Q14123
Residue:709
BDBM123687
NameBDBM123687
Synonyms:US8741907, 3 | US9067945, 2
TypeSmall organic molecule
Emp. Form.C17H26N4O
Mol. Mass.302.4145
SMILESCCC(CC)n1ncc2c1nc(CC1CCCCC1)[nH]c2=O