Reaction Details
TargetHigh affinity cGMP-specific 3',5'-cyclic phosphodiesterase 9A
LigandBDBM123688
Substrate/Competitorn/a
Meas. Tech.In Vitro Inhibition Assay
pH7.5±n/a
IC50 30±n/a nM
Commentsextracted
Citation Hendrix, MBöβ, FBurkhardt, NErb, CTersteegen, AVan Kampen, M Alkyl-substituted pyrazolopyrimidines US Patent US8741907 Publication Date 6/3/2014
 
High affinity cGMP-specific 3',5'-cyclic phosphodiesterase 9A
Name:High affinity cGMP-specific 3',5'-cyclic phosphodiesterase 9A
Type:Protein
Mol. Mass.:68488.40
Organism:Homo sapiens (Human)
Description:O76083
Residue:593
BDBM123688
NameBDBM123688
Synonyms:US8741907, 4
TypeSmall organic molecule
Emp. Form.C15H22N4O
Mol. Mass.274.3614
SMILESCCC(C)Cc1nc2n(ncc2c(=O)[nH]1)C1CCCC1