Reaction Details
TargetPhospholipase D
LigandBDBM87231
Substrate/Competitorn/a
Meas. Tech.PLD In Vitro Kinetic Assay
Temperature310.15±0 K
IC50 1225±n/a nM
Citation Kulkarni, AQuang, PCurry, VKeyes, RZhou, WCho, HBaffoe, JTorok, BStieglitz, K 1,3-disubstituted-4-aminopyrazolo [3, 4-d] pyrimidines, a new class of potent inhibitors for phospholipase D. Chem Biol Drug Des84:270-81 (2014) 
 
Phospholipase D
Name:Phospholipase D
Synonyms:Phospholipase D (PLD_sp)
Type:Protein
Mol. Mass.:54006.04
Organism:Streptomyces sp. PMF
Description:P84147
Residue:506
BDBM87231
NameBDBM87231
TypeSmall organic molecule
Emp. Form.C25H27N5O2
Mol. Mass.429.5142
SMILESO=C(NCCN1CCC2(CC1)N(CNC2=O)c1ccccc1)c1cnc2ccccc2c1