Reaction Details
TargetPhospholipase D
LigandBDBM123744
Substrate/Competitorn/a
Meas. Tech.PLD In Vitro Kinetic Assay
Temperature310.15±0 K
IC50 100±n/a nM
Citation Kulkarni, AQuang, PCurry, VKeyes, RZhou, WCho, HBaffoe, JTorok, BStieglitz, K 1,3-disubstituted-4-aminopyrazolo [3, 4-d] pyrimidines, a new class of potent inhibitors for phospholipase D. Chem Biol Drug Des84:270-81 (2014) 
 
Phospholipase D
Name:Phospholipase D
Synonyms:Phospholipase D (PLD_sp)
Type:Protein
Mol. Mass.:54006.04
Organism:Streptomyces sp. PMF
Description:P84147
Residue:506
BDBM123744
NameBDBM123744
TypeSmall organic molecule
Emp. Form.C23H24FN5O2
Mol. Mass.421.4674
SMILESFc1ccc2[nH]c(cc2c1)C(=O)NCCN1CCC(CC1)n1c2ccccc2[nH]c1=O