Reaction Details
TargetPhospholipase D1
LigandBDBM123757
Substrate/Competitorn/a
Meas. Tech.PLD In Vitro Kinetic Assay
Temperature310.15±0 K
IC50 150±n/a nM
Citation Kulkarni, AQuang, PCurry, VKeyes, RZhou, WCho, HBaffoe, JTorok, BStieglitz, K 1,3-disubstituted-4-aminopyrazolo [3, 4-d] pyrimidines, a new class of potent inhibitors for phospholipase D. Chem Biol Drug Des84:270-81 (2014) 
 
Phospholipase D1
Name:Phospholipase D1
Type:Protein
Mol. Mass.:124219.92
Organism:Homo sapiens (Human)
Description:Q13393
Residue:1074
BDBM123757
NameBDBM123757
Synonyms:1,3-dimethyl-1H-pyrazolo[3,4-d]pyrimidin-4-amine (16)
TypeSmall organic molecule
Emp. Form.C7H9N5
Mol. Mass.163.1799
SMILESCc1nn(C)c2ncnc(N)c12