Reaction Details
TargetPhospholipase D1
LigandBDBM123760
Substrate/Competitorn/a
Meas. Tech.PLD In Vitro Kinetic Assay
Temperature310.15±0 K
IC50 500±n/a nM
Citation Kulkarni, AQuang, PCurry, VKeyes, RZhou, WCho, HBaffoe, JTorok, BStieglitz, K 1,3-disubstituted-4-aminopyrazolo [3, 4-d] pyrimidines, a new class of potent inhibitors for phospholipase D. Chem Biol Drug Des84:270-81 (2014) 
 
Phospholipase D1
Name:Phospholipase D1
Type:Protein
Mol. Mass.:124219.92
Organism:Homo sapiens (Human)
Description:Q13393
Residue:1074
BDBM123760
NameBDBM123760
Synonyms:3-methyl-1H-pyrazolo[3,4-d]pyrimidin-4-amine (19)
TypeSmall organic molecule
Emp. Form.C6H7N5
Mol. Mass.149.1533
SMILESCc1[nH]nc2ncnc(N)c12