Reaction Details
TargetPhospholipase D
LigandBDBM123745
Substrate/Competitorn/a
Meas. Tech.PLD In Vitro Kinetic Assay
Temperature310.15±0 K
IC50 10±n/a nM
Citation Kulkarni, AQuang, PCurry, VKeyes, RZhou, WCho, HBaffoe, JTorok, BStieglitz, K 1,3-disubstituted-4-aminopyrazolo [3, 4-d] pyrimidines, a new class of potent inhibitors for phospholipase D. Chem Biol Drug Des84:270-81 (2014) 
 
Phospholipase D
Name:Phospholipase D
Synonyms:Phospholipase D (PLD_sp)
Type:Protein
Mol. Mass.:54006.04
Organism:Streptomyces sp. PMF
Description:P84147
Residue:506
BDBM123745
NameBDBM123745
Synonyms:1-(4-methoxyphenyl)-3-(naphthalen-1-yl)-1H-pyrazolo[3,4-d]pyrimidin-4-amine (1)
TypeSmall organic molecule
Emp. Form.C22H17N5O
Mol. Mass.367.4033
SMILESCOc1ccc(cc1)-n1nc(-c2cccc3ccccc23)c2c(N)ncnc12