Reaction Details
TargetPhospholipase D
LigandBDBM123750
Substrate/Competitorn/a
Meas. Tech.PLD In Vitro Kinetic Assay
Temperature310.15±0 K
IC50 450±n/a nM
Citation Kulkarni, AQuang, PCurry, VKeyes, RZhou, WCho, HBaffoe, JTorok, BStieglitz, K 1,3-disubstituted-4-aminopyrazolo [3, 4-d] pyrimidines, a new class of potent inhibitors for phospholipase D. Chem Biol Drug Des84:270-81 (2014) 
 
Phospholipase D
Name:Phospholipase D
Synonyms:Phospholipase D (PLD_sp)
Type:Protein
Mol. Mass.:54006.04
Organism:Streptomyces sp. PMF
Description:P84147
Residue:506
BDBM123750
NameBDBM123750
Synonyms:1-(2-ethylphenyl)-3-phenyl-1H-pyrazolo[3,4-d]pyrimidin-4-amine (8)
TypeSmall organic molecule
Emp. Form.C19H17N5
Mol. Mass.315.3718
SMILESCCc1ccccc1-n1nc(-c2ccccc2)c2c(N)ncnc12