Reaction Details
TargetPhospholipase D
LigandBDBM123759
Substrate/Competitorn/a
Meas. Tech.PLD In Vitro Kinetic Assay
Temperature310.15±0 K
IC50 1750±n/a nM
Citation Kulkarni, AQuang, PCurry, VKeyes, RZhou, WCho, HBaffoe, JTorok, BStieglitz, K 1,3-disubstituted-4-aminopyrazolo [3, 4-d] pyrimidines, a new class of potent inhibitors for phospholipase D. Chem Biol Drug Des84:270-81 (2014) 
 
Phospholipase D
Name:Phospholipase D
Synonyms:Phospholipase D (PLD_sp)
Type:Protein
Mol. Mass.:54006.04
Organism:Streptomyces sp. PMF
Description:P84147
Residue:506
BDBM123759
NameBDBM123759
Synonyms:3‐(naphthalen‐2‐yl)‐1H‐pyrazolo[3,4‐d]pyrimidin‐4‐ amine (18)
TypeSmall organic molecule
Emp. Form.C15H11N5
Mol. Mass.261.2813
SMILESNc1ncnc2n[nH]c(-c3ccc4ccccc4c3)c12