Reaction Details
TargetRhodopsin kinase GRK1
LigandBDBM50173310
Substrate/Competitorn/a
Meas. Tech.Assays for Inhibition of GRKs
pH7±n/a
IC50 3900±n/a nM
Commentsextracted
Citation Larsen, SDHoman, KWaldschmidt, HTesmer, JJ G protein-coupled receptor kinase 2 inhibitors and methods for use of the same US Patent US10023564 Publication Date 7/17/2018
 
Rhodopsin kinase GRK1
Name:Rhodopsin kinase GRK1
Type:PROTEIN
Mol. Mass.:63520.09
Organism:Homo sapiens (Human)
Description:ChEMBL_774378
Residue:563
BDBM50173310
NameBDBM50173310
Synonyms:CHEMBL3808660 | US10023564, Example 1
TypeSmall organic molecule
Emp. Form.C26H22FN7O3
Mol. Mass.499.4964
SMILESCC1=C(C(NC(=O)N1)c1ccc(F)c(c1)C(=O)NCc1ccccn1)C(=O)Nc1ccc2[nH]ncc2c1