Reaction Details
TargetG protein-coupled receptor kinase 5
LigandBDBM50173323
Substrate/Competitorn/a
Meas. Tech.Assays for Inhibition of GRKs
pH7±n/a
IC50 5000±n/a nM
Commentsextracted
Citation Larsen, SDHoman, KWaldschmidt, HTesmer, JJ G protein-coupled receptor kinase 2 inhibitors and methods for use of the same US Patent US10023564 Publication Date 7/17/2018
 
G protein-coupled receptor kinase 5
Name:G protein-coupled receptor kinase 5
Type:PROTEIN
Mol. Mass.:67798.93
Organism:Homo sapiens (Human)
Description:ChEMBL_1280627
Residue:590
BDBM50173323
NameBDBM50173323
Synonyms:CHEMBL3808621 | US10023564, Example 2
TypeSmall organic molecule
Emp. Form.C27H21F3N6O3
Mol. Mass.534.4892
SMILESCC1=C(C(NC(=O)N1)c1ccc(F)c(c1)C(=O)NCc1c(F)cccc1F)C(=O)Nc1ccc2[nH]ncc2c1