Reaction Details
TargetRho-associated protein kinase 1
LigandBDBM50173325
Substrate/Competitorn/a
Meas. Tech.Assays for Inhibition of ROCK
IC50 57.0±n/a nM
Citation Larsen, SDHoman, KWaldschmidt, HTesmer, JJ G protein-coupled receptor kinase 2 inhibitors and methods for use of the same US Patent US10023564 Publication Date 7/17/2018
 
Rho-associated protein kinase 1
Name:Rho-associated protein kinase 1
Type:Serine/threonine-protein kinase
Mol. Mass.:158156.77
Organism:Homo sapiens (Human)
Description:Q13464
Residue:1354
BDBM50173325
NameBDBM50173325
Synonyms:CHEMBL3809965 | US10023564, Example 5
TypeSmall organic molecule
Emp. Form.C28H25FN6O4
Mol. Mass.528.5343
SMILESCOc1ccccc1CNC(=O)c1cc(ccc1F)C1NC(=O)NC(C)=C1C(=O)Nc1ccc2[nH]ncc2c1