Reaction Details
TargetRho-associated protein kinase 1
LigandBDBM50173306
Substrate/Competitorn/a
Meas. Tech.Assays for Inhibition of ROCK
IC50>100000±n/a nM
Citation Larsen, SDHoman, KWaldschmidt, HTesmer, JJ G protein-coupled receptor kinase 2 inhibitors and methods for use of the same US Patent US10023564 Publication Date 7/17/2018
 
Rho-associated protein kinase 1
Name:Rho-associated protein kinase 1
Type:Serine/threonine-protein kinase
Mol. Mass.:158156.77
Organism:Homo sapiens (Human)
Description:Q13464
Residue:1354
BDBM50173306
NameBDBM50173306
Synonyms:CHEMBL3808565 | US10023564, Example 7
TypeSmall organic molecule
Emp. Form.C27H24FN7O3
Mol. Mass.513.523
SMILESCC1=C(C(NC(=O)N1)c1ccc(F)c(c1)C(=O)NCCc1ccncc1)C(=O)Nc1ccc2[nH]ncc2c1