Reaction Details
TargetRhodopsin kinase GRK1
LigandBDBM283998
Substrate/Competitorn/a
Meas. Tech.Assays for Inhibition of GRKs
pH7±n/a
IC50 18000±n/a nM
Commentsextracted
Citation Larsen, SDHoman, KWaldschmidt, HTesmer, JJ G protein-coupled receptor kinase 2 inhibitors and methods for use of the same US Patent US10023564 Publication Date 7/17/2018
 
Rhodopsin kinase GRK1
Name:Rhodopsin kinase GRK1
Type:PROTEIN
Mol. Mass.:63520.09
Organism:Homo sapiens (Human)
Description:ChEMBL_774378
Residue:563
BDBM283998
NameBDBM283998
Synonyms:E24 | US10023564, Example 24
TypeSmall organic molecule
Emp. Form.C25H23FN8O5
Mol. Mass.534.4991
SMILESCOCc1noc(CNC(=O)c2cc(ccc2F)C2NC(=O)NC(C)=C2C(=O)Nc2ccc3[nH]ncc3c2)n1