Reaction Details
TargetRhodopsin kinase GRK1
LigandBDBM284000
Substrate/Competitorn/a
Meas. Tech.Assays for Inhibition of GRKs
pH7±n/a
IC50>100000±n/a nM
Commentsextracted
Citation Larsen, SDHoman, KWaldschmidt, HTesmer, JJ G protein-coupled receptor kinase 2 inhibitors and methods for use of the same US Patent US10023564 Publication Date 7/17/2018
 
Rhodopsin kinase GRK1
Name:Rhodopsin kinase GRK1
Type:PROTEIN
Mol. Mass.:63520.09
Organism:Homo sapiens (Human)
Description:ChEMBL_774378
Residue:563
BDBM284000
NameBDBM284000
Synonyms:E26 | US10023564, Example 26
TypeSmall organic molecule
Emp. Form.C26H25FN8O3
Mol. Mass.516.5269
SMILESCN(Cc1cc(C)[nH]n1)C(=O)c1cc(ccc1F)C1NC(=O)NC(C)=C1C(=O)Nc1ccc2[nH]ncc2c1